{"text_format":"1","workbook":"xlsx","n_sheets":4,"sheets":["DATOS FISCALES","130","CALCULOS","Acerca de"],"not_rendered":{"charts":0,"images":0,"macros":1,"external_links":0,"defined_names":7,"comments":3,"pivot_tables":0},"unopened":[],"bounds":{"document_bytes":16777216,"sheet_cells":100000,"rows_first":2000,"rows_last":500,"rows_between":2000,"halvings":0,"cell_chars":16384,"cell_head_chars":4096},"cells_cut":0,"cells_raw":0,"read":"whole","date_system":"1900"}

{"sheet":"DATOS FISCALES","index":0,"n_rows":271,"n_cols":9,"rows_kept":271,"cut":false,"hidden":false,"merged":[]}
[]
[null,"NIF","34999999W","Para calcular la casilla 13 del Modelo 130"]
[null,"Nombre o Razón Social",null,"(es decir, la deducción del artículo 10.3 c) del Reglamento del IRPF)"]
[null,"Nombre","NOMBRE","Se calcula según los rendimientos netos del ejercicio anterior"]
[null,"Primer Apellido","APELLIDOA","Este importe lo obtenemos:"]
[null,"Segundo Apellido","APELLIDOB"," - De la casilla 03 del Modelo 130 del último trimestre del año anterior"]
[null,"IBAN de la cuenta bancaria","ES9999999999999999999999"," - O bien, de la casilla 118 de la declaración anual de IRPF (Modelo 100)"]
[null,"DEL AÑO ANTERIOR: Casilla [03] del último trimestre del Modelo 130 (o bien la suma de las casillas [118] de la declaración anual de IRPF",9000,"<<<<<<<<<<<<<<<< escribir aquí este importe"]
[null,"Tipo de actividad / clave IRPF Anual",5]
[null,"Tipo de actividad / clave Modelo 390",1]
[null,"Grupo o epígrafe IAE",111]
[null,"IVA: Opción por el régimen especial del criterio de caja","NO","Macro: \"Ocultar columnas recargo equivalencia\" (Ctl+o)"]
[null,"Primer Tipo de IVA",4,"Tipo Recargo Equivalencia",0.5]
[null,"Segundo Tipo de IVA",10,"Tipo de Recargo Equivalencia",1.4]
[null,"Tercer Tipo de IVA",21,"Tipo de Recargo Equivalencia",5.2]
[null,"Localidad","CIUDAD"]
[null,"Teléfono",999999999]
[null,"Código Delegación","32600",{"$f":"VLOOKUP(C18,D20:E271,2,FALSE)","v":"OURENSE"}]
[null,"Observaciones",null,"LISTADO CÓDIGOS DELEGACIONES",null,"LISTADO CÓDIGO PROVINCIAS PARA MODELO 347",null,null,"Lista Trimestres"]
[null,"Enlaces",null,"01600","ALAVA","ARABA/ÁLAVA","01",null,"1T"]
{"$rows_left_out":252}
{"sheet":"130","index":1,"n_rows":99,"n_cols":42,"rows_kept":99,"cut":false,"hidden":false,"merged":[[4,27,4,30],[67,5,67,6],[58,14,58,20],[60,8,60,9],[72,16,72,17],[72,18,72,20],[72,2,72,6],[72,8,72,9],[72,10,72,11],[72,12,72,15],[60,15,60,16]]}
[]
[null,null,"IRPF Actividades económicas en estimación directa. Pago fraccionado",null,null,null,null,null,null,null,null,null,null,null,null,null,null,null,null,null,null,null,null,null,null,null,null,null,null,null,null,null,null,null,null,null,null,"Modelo 130",null,"Mostrar Calculadora de Windows (Ctl+w)"]
[]
[null,null,"NIF"]
[null,null,{"$f":"'DATOS FISCALES'!C2","v":"34999999W"},null,null,null,null,null,null,null,null,null,null,null,null,null,null,null,null,null,null,null,null,"Ejercicio",null,null,null,{"$f":"IF(NOT(ISBLANK(#REF!)),YEAR(#REF!),IF(NOT(ISBLANK(#REF!)),YEAR(#REF!),YEAR(TODAY())))","v":{"$error":"#REF!"}},null,null,null,null,null,"Período",null,null,null,"1T"]
[null,null,"Nombre"]
[null,null,{"$f":"'DATOS FISCALES'!C4","v":"NOMBRE"}]
[null,null,"Apellidos",null,null,null,null,null,null,null,null,null,null,null,null,null,null,null,null,null,null,null,null,null,null,null,null,null,null,null,null,null,null,null,null,null,null,null,null,{"$f":"HYPERLINK(\"C:\\AEAT\",\"ABRIR CARPETA C:\\AEAT\")","v":"ABRIR CARPETA C:\\AEAT"},null,"PAGO IMPUESTOS"]
[null,null,{"$f":"'DATOS FISCALES'!C5&\" \"&'DATOS FISCALES'!C6","v":"APELLIDOA APELLIDOB"},null,null,null,null,null,null,null,null,null,null,null,null,null,null,null,null,null,null,null,null,null,null,null,null,null,null,null,null,null,null,null,null,null,null,null,null,"PRESENTAR ELECTRÓNICA",null,"Consulta de declaraciones presentadas"]
[]
[]
[null,null,"I. Actividades económ. en estimación directa, modalidad normal o simplificada, distintas de agrícolas, ganaderas, "]
[null,null,"forestales y pesqueras. (Datos acumulados del periodo comprendido entre el primer día del año y el último día del trimestre)",null,null,null,null,null,null,null,null,null,null,null,null,null,null,null,null,null,null,null,null,null,null,null,null,null,null,null,null,null,null,null,null,null,null,null,null,null,null,"Diseños de registro"]
[]
[null,null,"Ingresos computables correspondientes al conjunto de las actividades ejercidas ……………………….",null,null,null,null,null,null,null,null,null,null,null,null,null,null,null,null,null,null,null,null,null,null,null,null,null,null,null,null,null,null,null,null,null,"01",{"$f":"VLOOKUP($AL$5,CALCULOS!A5:P8,2,FALSE)","v":{"$error":"#REF!"}}]
[null,null,"Gastos fiscalmente deducibles correspondientes al conjunto de actividades ejercidas …………………",null,null,null,null,null,null,null,null,null,null,null,null,null,null,null,null,null,null,null,null,null,null,null,null,null,null,null,null,null,null,null,null,null,"02",{"$f":"VLOOKUP($AL$5,CALCULOS!A5:P8,4,FALSE)","v":{"$error":"#REF!"}}]
[null,null,"Rendimiento neto ([01]-[02]). Si se obtiene una cantidad negativa, consígnela con signo menos (-) …..",null,null,null,null,null,null,null,null,null,null,null,null,null,null,null,null,null,null,null,null,null,null,null,null,null,null,null,null,null,null,null,null,null,"03",{"$f":"AL15-AL16","v":{"$error":"#REF!"}}]
[null,null,"20 por 100 del importe de la casilla [03], si dicho importe es positivo ……………………………………..",null,null,null,null,null,null,null,null,null,null,null,null,null,null,null,null,null,null,null,null,null,null,null,null,null,null,null,null,null,null,null,null,null,"04",{"$f":"ROUND(IF(AL17>0,0.2*AL17,0),2)","v":{"$error":"#REF!"}}]
[null,null,"(Si la casilla [03] fuese negativa, consigne el número cero)"]
[null,null,"A deducir:"]
{"$rows_left_out":80}
{"sheet":"CALCULOS","index":2,"n_rows":23,"n_cols":71,"rows_kept":23,"cut":false,"hidden":false,"merged":[[11,41,12,41],[20,33,20,34],[20,35,20,40],[20,41,20,46],[11,35,11,39],[11,40,12,40],[11,34,12,34],[11,27,11,30],[11,31,11,32],[11,33,12,33],[20,69,20,70],[20,47,20,52],[20,53,20,58],[20,59,20,64],[20,65,20,66],[20,67,20,68],[20,27,20,32]]}
[]
["CÁLCULOS TRIMESTRALES PARA EL MODELO 130: IRPF"]
[]
["TRIMESTRE","Ingresos Casilla [01]","Gastos Brutos","Casilla [02] Gastos con deducción","Casilla [05]","Casilla [06] Retenc.\nsoportad","Casilla [07] Pago fraccionado",null,null,"Casilla [11]","Casilla [12]","Casilla [13] Deducción del art. 110.3 c) Regl. IRPF","Casilla [15]\nCompensar negativas anteriores","Casilla [17]","Casilla [18]","Casilla [19]"]
["1T",{"$f":"SUMIF(#REF!,1,#REF!)","v":{"$error":"#REF!"}},{"$f":"SUMIF(#REF!,1,#REF!)","v":{"$error":"#REF!"}},{"$f":"IF((B5-C5)>=0,C5+MIN(ROUND(0.05*(B5-C5),2),2000),C5)","v":{"$error":"#REF!"}},0,{"$f":"ROUND(SUMIF(#REF!,1,#REF!),2)","v":{"$error":"#REF!"}},{"$f":"ROUND(IF((B5-D5)>=0,0.2*(B5-D5),0)-(E5+F5),2)","v":{"$error":"#REF!"}},null,null,null,{"$f":"IF(G5+J5>0,G5+J5,0)","v":{"$error":"#REF!"}},{"$f":"IF('DATOS FISCALES'!C$8>12000,0,IF('DATOS FISCALES'!C$8>=11000.01,25,IF('DATOS FISCALES'!C$8>=10000.01,50,IF('DATOS FISCALES'!C$8>=9000.01,75,100))))","v":100},0,{"$f":"K5-L5-M5","v":{"$error":"#REF!"}},null,{"$f":"N5-O5","v":{"$error":"#REF!"}}]
["2T",{"$f":"SUMIF(#REF!,\"<=2\",#REF!)","v":{"$error":"#REF!"}},{"$f":"SUMIF(#REF!,\"<=2\",#REF!)","v":{"$error":"#REF!"}},{"$f":"IF((B6-C6)>=0,C6+MIN(ROUND(0.05*(B6-C6),2),2000),C6)","v":{"$error":"#REF!"}},{"$f":"IF(G5>0,G5,0)","v":{"$error":"#REF!"}},{"$f":"ROUND(SUMIF(#REF!,\"<=2\",#REF!),2)","v":{"$error":"#REF!"}},{"$f":"ROUND(IF((B6-D6)>=0,0.2*(B6-D6),0)-(E6+F6),2)","v":{"$error":"#REF!"}},null,null,null,{"$f":"IF(G6+J6>0,G6+J6,0)","v":{"$error":"#REF!"}},{"$f":"IF('DATOS FISCALES'!C$8>12000,0,IF('DATOS FISCALES'!C$8>=11000.01,25,IF('DATOS FISCALES'!C$8>=10000.01,50,IF('DATOS FISCALES'!C$8>=9000.01,75,100))))","v":100},{"$f":"IF(AND(K6-L6>0,P5<0),IF(ABS(P5)<K6-L6,ABS(P5),K6-L6),0)","v":{"$error":"#REF!"}},{"$f":"K6-L6-M6","v":{"$error":"#REF!"}},null,{"$f":"N6-O6","v":{"$error":"#REF!"}}]
["3T",{"$f":"SUMIF(#REF!,\"<=3\",#REF!)","v":{"$error":"#REF!"}},{"$f":"SUMIF(#REF!,\"<=3\",#REF!)","v":{"$error":"#REF!"}},{"$f":"IF((B7-C7)>=0,C7+MIN(ROUND(0.05*(B7-C7),2),2000),C7)","v":{"$error":"#REF!"}},{"$f":"E6+IF(G6>0,G6,0)","v":{"$error":"#REF!"}},{"$f":"ROUND(SUMIF(#REF!,\"<=3\",#REF!),2)","v":{"$error":"#REF!"}},{"$f":"ROUND(IF((B7-D7)>=0,0.2*(B7-D7),0)-(E7+F7),2)","v":{"$error":"#REF!"}},null,null,null,{"$f":"IF(G7+J7>0,G7+J7,0)","v":{"$error":"#REF!"}},{"$f":"IF('DATOS FISCALES'!C$8>12000,0,IF('DATOS FISCALES'!C$8>=11000.01,25,IF('DATOS FISCALES'!C$8>=10000.01,50,IF('DATOS FISCALES'!C$8>=9000.01,75,100))))","v":100},{"$f":"IF(AND(K7-L7>0,(IF(P6<0,P6,0)+IF(M6+P5<0,M6+P5,0))<0),IF(ABS(IF(P6<0,P6,0)+IF(M6+P5<0,M6+P5,0))<K7-L7,ABS(IF(P6<0,P6,0)+IF(M6+P5<0,M6+P5,0)),K7-L7),0)","v":{"$error":"#REF!"}},{"$f":"K7-L7-M7","v":{"$error":"#REF!"}},null,{"$f":"N7-O7","v":{"$error":"#REF!"}}]
["4T",{"$f":"SUMIF(#REF!,\"<=4\",#REF!)","v":{"$error":"#REF!"}},{"$f":"SUMIF(#REF!,\"<=4\",#REF!)","v":{"$error":"#REF!"}},{"$f":"IF((B8-C8)>=0,C8+MIN(ROUND(0.05*(B8-C8),2),2000),C8)","v":{"$error":"#REF!"}},{"$f":"E7+IF(G7>0,G7,0)","v":{"$error":"#REF!"}},{"$f":"ROUND(SUMIF(#REF!,\"<=4\",#REF!),2)","v":{"$error":"#REF!"}},{"$f":"ROUND(IF((B8-D8)>=0,0.2*(B8-D8),0)-(E8+F8),2)","v":{"$error":"#REF!"}},null,null,null,{"$f":"IF(G8+J8>0,G8+J8,0)","v":{"$error":"#REF!"}},{"$f":"IF('DATOS FISCALES'!C$8>12000,0,IF('DATOS FISCALES'!C$8>=11000.01,25,IF('DATOS FISCALES'!C$8>=10000.01,50,IF('DATOS FISCALES'!C$8>=9000.01,75,100))))","v":100},{"$f":"IF(AND(K8-L8>0,SUM(M6:M7)+SUMIF(P5:P7,\"<0\")<0),IF(ABS(SUM(M6:M7)+SUMIF(P5:P7,\"<0\"))<K8-L8,ABS(SUM(M6:M7)+SUMIF(P5:P7,\"<0\")),K8-L8),0)","v":{"$error":"#REF!"}},{"$f":"K8-L8-M8","v":{"$error":"#REF!"}},null,{"$f":"N8-O8","v":{"$error":"#REF!"}}]
[]
[]
[]
[null,null,null,null,null,null,null,null,null,null,null,null,null,null,null,null,null,null,null,null,null,null,null,null,null,null,null,"IVA Deducible Adquisiciones Intracomunitarias",null,null,null,"Rectificación Deducciones",null,"Compensac. Rég. Esp. Agric. Ganad. y P. [42]","Resultado régimen general [46]","Información Adicional",null,null,null,null,"Cuotas a compensar trimestres Anteriores [67]","Resultado [69] y Resultado Liquid. [71]"]
[null,null,null,null,null,null,null,null,null,null,null,null,null,null,null,null,null,null,null,null,null,null,null,null,null,null,null,"Bases bienes y servicios corrientes [36]","Cuotas bienes y servicios corrientes [37]","Bases bienes de inversión [38]","Cuotas bienes de inversión [39]","Base Imponible [40]","Cuota [41]",null,null,"Entregas Intrac. de bienes y servicios [59]","Bases entregas en RECC calculadas según regla general devengo [62]","Cuotas entregas en RECC pero cálculo según regla general devengo [63]","Bases adquisic. en RECC pero cálculo según regla general devengo [74]","Cuotas adquisic. en RECC pero cálculo según regla general devengo [75]"]
[null,null,null,null,null,null,null,null,null,null,null,null,null,null,null,null,null,null,null,null,null,null,null,null,null,null,null,{"$f":"SUMPRODUCT((#REF!=#REF!)*ISNUMBER(#REF!)*#REF!)-AD14","v":{"$error":"#REF!"}},{"$f":"SUMPRODUCT((#REF!=#REF!)*ISNUMBER(#REF!)*#REF!)-AE14","v":{"$error":"#REF!"}},{"$f":"SUMPRODUCT((#REF!=#REF!)*(#REF!=3)*#REF!)","v":{"$error":"#REF!"}},{"$f":"SUMPRODUCT((#REF!=#REF!)*(#REF!=3)*#REF!)","v":{"$error":"#REF!"}},{"$f":"IF(AND(#REF!=0,#REF!=0),SUMPRODUCT((#REF!=#REF!)*(#REF!>0)*ISBLANK(#REF!)*(#REF!=1)*#REF!),SUMPRODUCT((#REF!=#REF!)*(#REF!>0)*ISBLANK(#REF!)*(#REF!=1)*#REF!))","v":{"$error":"#REF!"}},{"$f":"IF(AND(#REF!=0,#REF!=0),SUMPRODUCT((#REF!=#REF!)*ISBLANK(#REF!)*(#REF!=1)*#REF!),SUMPRODUCT((#REF!=#REF!)*ISBLANK(#REF!)*(#REF!=1)*#REF!))","v":{"$error":"#REF!"}},{"$f":"IF(AND(#REF!=0,#REF!=0),SUMPRODUCT((#REF!=#REF!)*#REF!),SUMPRODUCT((#REF!=#REF!)*#REF!))","v":{"$error":"#REF!"}},{"$f":"SUM(#REF!,#REF!,#REF!,#REF!,#REF!,#REF!,#REF!,#REF!)-#REF!-SUM(#REF!,#REF!,AG14,AH14)","v":{"$error":"#REF!"}},{"$f":"SUMPRODUCT((#REF!=#REF!)*ISNUMBER(#REF!)*#REF!)","v":{"$error":"#REF!"}},{"$f":"IF(#REF!=1,SUMPRODUCT((#REF!=#REF!)*(#REF!=1)*NOT(ISBLANK(#REF!))*#REF!),0)","v":{"$error":"#REF!"}},{"$f":"IF(#REF!=1,SUMPRODUCT((#REF!=#REF!)*(#REF!=1)*NOT(ISBLANK(#REF!))*#REF!),0)","v":{"$error":"#REF!"}},{"$f":"IF(OR(#REF!=1,#REF!=1),SUMPRODUCT((#REF!=#REF!)*(#REF!>0)*NOT(ISBLANK(#REF!))*#REF!),0)","v":{"$error":"#REF!"}},{"$f":"IF(OR(#REF!=1,#REF!=1),SUMPRODUCT((#REF!=#REF!)*(#REF!>0)*NOT(ISBLANK(#REF!))*#REF!),0)","v":{"$error":"#REF!"}},null,{"$f":"AI14-AO14","v":{"$error":"#REF!"}}]
[null,null,null,null,null,null,null,null,null,null,null,null,null,null,null,null,null,null,null,null,null,null,null,null,null,null,null,{"$f":"SUMPRODUCT((#REF!=#REF!)*ISNUMBER(#REF!)*#REF!)-AD15","v":{"$error":"#REF!"}},{"$f":"SUMPRODUCT((#REF!=#REF!)*ISNUMBER(#REF!)*#REF!)-AE15","v":{"$error":"#REF!"}},{"$f":"SUMPRODUCT((#REF!=#REF!)*(#REF!=3)*#REF!)","v":{"$error":"#REF!"}},{"$f":"SUMPRODUCT((#REF!=#REF!)*(#REF!=3)*#REF!)","v":{"$error":"#REF!"}},{"$f":"IF(AND(#REF!=0,#REF!=0),SUMPRODUCT((#REF!=#REF!)*(#REF!>0)*ISBLANK(#REF!)*(#REF!=1)*#REF!),SUMPRODUCT((#REF!=#REF!)*(#REF!>0)*ISBLANK(#REF!)*(#REF!=1)*#REF!))","v":{"$error":"#REF!"}},{"$f":"IF(AND(#REF!=0,#REF!=0),SUMPRODUCT((#REF!=#REF!)*ISBLANK(#REF!)*(#REF!=1)*#REF!),SUMPRODUCT((#REF!=#REF!)*ISBLANK(#REF!)*(#REF!=1)*#REF!))","v":{"$error":"#REF!"}},{"$f":"IF(AND(#REF!=0,#REF!=0),SUMPRODUCT((#REF!=#REF!)*#REF!),SUMPRODUCT((#REF!=#REF!)*#REF!))","v":{"$error":"#REF!"}},{"$f":"SUM(#REF!,#REF!,#REF!,#REF!,#REF!,#REF!,#REF!,#REF!)-#REF!-SUM(#REF!,#REF!,AG15,AH15)","v":{"$error":"#REF!"}},{"$f":"SUMPRODUCT((#REF!=#REF!)*ISNUMBER(#REF!)*#REF!)","v":{"$error":"#REF!"}},{"$f":"IF(#REF!=1,SUMPRODUCT((#REF!=#REF!)*(#REF!=1)*NOT(ISBLANK(#REF!))*#REF!),0)","v":{"$error":"#REF!"}},{"$f":"IF(#REF!=1,SUMPRODUCT((#REF!=#REF!)*(#REF!=1)*NOT(ISBLANK(#REF!))*#REF!),0)","v":{"$error":"#REF!"}},{"$f":"IF(OR(#REF!=1,#REF!=1),SUMPRODUCT((#REF!=#REF!)*(#REF!>0)*NOT(ISBLANK(#REF!))*#REF!),0)","v":{"$error":"#REF!"}},{"$f":"IF(OR(#REF!=1,#REF!=1),SUMPRODUCT((#REF!=#REF!)*(#REF!>0)*NOT(ISBLANK(#REF!))*#REF!),0)","v":{"$error":"#REF!"}},{"$f":"IF(AP14<0,ABS(AP14),0)","v":{"$error":"#REF!"}},{"$f":"AI15-AO15","v":{"$error":"#REF!"}}]
[null,null,null,null,null,null,null,null,null,null,null,null,null,null,null,null,null,null,null,null,null,null,null,null,null,null,null,{"$f":"SUMPRODUCT((#REF!=#REF!)*ISNUMBER(#REF!)*#REF!)-AD16","v":{"$error":"#REF!"}},{"$f":"SUMPRODUCT((#REF!=#REF!)*ISNUMBER(#REF!)*#REF!)-AE16","v":{"$error":"#REF!"}},{"$f":"SUMPRODUCT((#REF!=#REF!)*(#REF!=3)*#REF!)","v":{"$error":"#REF!"}},{"$f":"SUMPRODUCT((#REF!=#REF!)*(#REF!=3)*#REF!)","v":{"$error":"#REF!"}},{"$f":"IF(AND(#REF!=0,#REF!=0),SUMPRODUCT((#REF!=#REF!)*(#REF!>0)*ISBLANK(#REF!)*(#REF!=1)*#REF!),SUMPRODUCT((#REF!=#REF!)*(#REF!>0)*ISBLANK(#REF!)*(#REF!=1)*#REF!))","v":{"$error":"#REF!"}},{"$f":"IF(AND(#REF!=0,#REF!=0),SUMPRODUCT((#REF!=#REF!)*ISBLANK(#REF!)*(#REF!=1)*#REF!),SUMPRODUCT((#REF!=#REF!)*ISBLANK(#REF!)*(#REF!=1)*#REF!))","v":{"$error":"#REF!"}},{"$f":"IF(AND(#REF!=0,#REF!=0),SUMPRODUCT((#REF!=#REF!)*#REF!),SUMPRODUCT((#REF!=#REF!)*#REF!))","v":{"$error":"#REF!"}},{"$f":"SUM(#REF!,#REF!,#REF!,#REF!,#REF!,#REF!,#REF!,#REF!)-#REF!-SUM(#REF!,#REF!,AG16,AH16)","v":{"$error":"#REF!"}},{"$f":"SUMPRODUCT((#REF!=#REF!)*ISNUMBER(#REF!)*#REF!)","v":{"$error":"#REF!"}},{"$f":"IF(#REF!=1,SUMPRODUCT((#REF!=#REF!)*(#REF!=1)*NOT(ISBLANK(#REF!))*#REF!),0)","v":{"$error":"#REF!"}},{"$f":"IF(#REF!=1,SUMPRODUCT((#REF!=#REF!)*(#REF!=1)*NOT(ISBLANK(#REF!))*#REF!),0)","v":{"$error":"#REF!"}},{"$f":"IF(OR(#REF!=1,#REF!=1),SUMPRODUCT((#REF!=#REF!)*(#REF!>0)*NOT(ISBLANK(#REF!))*#REF!),0)","v":{"$error":"#REF!"}},{"$f":"IF(OR(#REF!=1,#REF!=1),SUMPRODUCT((#REF!=#REF!)*(#REF!>0)*NOT(ISBLANK(#REF!))*#REF!),0)","v":{"$error":"#REF!"}},{"$f":"IF(AP15<0,ABS(AP15),0)","v":{"$error":"#REF!"}},{"$f":"AI16-AO16","v":{"$error":"#REF!"}}]
[null,null,null,null,null,null,null,null,null,null,null,null,null,null,null,null,null,null,null,null,null,null,null,null,null,null,null,{"$f":"SUMPRODUCT((#REF!=#REF!)*ISNUMBER(#REF!)*#REF!)-AD17","v":{"$error":"#REF!"}},{"$f":"SUMPRODUCT((#REF!=#REF!)*ISNUMBER(#REF!)*#REF!)-AE17","v":{"$error":"#REF!"}},{"$f":"SUMPRODUCT((#REF!=#REF!)*(#REF!=3)*#REF!)","v":{"$error":"#REF!"}},{"$f":"SUMPRODUCT((#REF!=#REF!)*(#REF!=3)*#REF!)","v":{"$error":"#REF!"}},{"$f":"IF(AND(#REF!=0,#REF!=0),SUMPRODUCT((#REF!=#REF!)*(#REF!>0)*ISBLANK(#REF!)*(#REF!=1)*#REF!),SUMPRODUCT((#REF!=#REF!)*(#REF!>0)*ISBLANK(#REF!)*(#REF!=1)*#REF!))","v":{"$error":"#REF!"}},{"$f":"IF(AND(#REF!=0,#REF!=0),SUMPRODUCT((#REF!=#REF!)*ISBLANK(#REF!)*(#REF!=1)*#REF!),SUMPRODUCT((#REF!=#REF!)*ISBLANK(#REF!)*(#REF!=1)*#REF!))","v":{"$error":"#REF!"}},{"$f":"IF(AND(#REF!=0,#REF!=0),SUMPRODUCT((#REF!=#REF!)*#REF!),SUMPRODUCT((#REF!=#REF!)*#REF!))","v":{"$error":"#REF!"}},{"$f":"SUM(#REF!,#REF!,#REF!,#REF!,#REF!,#REF!,#REF!,#REF!)-#REF!-SUM(#REF!,#REF!,AG17,AH17)","v":{"$error":"#REF!"}},{"$f":"SUMPRODUCT((#REF!=#REF!)*ISNUMBER(#REF!)*#REF!)","v":{"$error":"#REF!"}},{"$f":"IF(#REF!=1,SUMPRODUCT((#REF!=#REF!)*(#REF!=1)*NOT(ISBLANK(#REF!))*#REF!),0)","v":{"$error":"#REF!"}},{"$f":"IF(#REF!=1,SUMPRODUCT((#REF!=#REF!)*(#REF!=1)*NOT(ISBLANK(#REF!))*#REF!),0)","v":{"$error":"#REF!"}},{"$f":"IF(OR(#REF!=1,#REF!=1),SUMPRODUCT((#REF!=#REF!)*(#REF!>0)*NOT(ISBLANK(#REF!))*#REF!),0)","v":{"$error":"#REF!"}},{"$f":"IF(OR(#REF!=1,#REF!=1),SUMPRODUCT((#REF!=#REF!)*(#REF!>0)*NOT(ISBLANK(#REF!))*#REF!),0)","v":{"$error":"#REF!"}},{"$f":"IF(AP16<0,ABS(AP16),0)","v":{"$error":"#REF!"}},{"$f":"AI17-AO17","v":{"$error":"#REF!"}}]
[]
[]
[]
{"$rows_left_out":4}
{"sheet":"Acerca de","index":3,"n_rows":55,"n_cols":16,"rows_kept":55,"cut":false,"hidden":false,"merged":[[6,0,6,14]]}
["Plantilla de Excel para gestión de impuestos"]
["Programa de Excel para gestión de impuestos de empresarios individuales y profesionales autónomos"]
[null,null,null,null,null,null,null,null,null,null,null,null,null,null,null,"Keywords"]
["Este archivo de Excel (\"plantilla\") se ofrece gratuitamente con la esperanza de que sea útil, pero SIN GARANTÍA ALGUNA;",null,null,null,null,null,null,null,null,null,null,null,null,null,null,"APLICACIÓN EXCEL"]
["ni siquiera la garantía implícita MERCANTIL o de APTITUD PARA UN PROPÓSITO DETERMINADO.",null,null,null,null,null,null,null,null,null,null,null,null,null,null,"GESTIÓN DE IMPUESTOS AUTÓNOMOS"]
[null,null,null,null,null,null,null,null,null,null,null,null,null,null,null,"CÁLCULO DE DECLARACIONES TRIMESTRALES EN EXCEL"]
["Se concede permiso para copiar, distribuir y/o modificar este documento bajo los términos de la Licencia de Documentación Libre de GNU, Versión 1.3 o cualquier otra versión posterior publicada por la Free Software Foundation.",null,null,null,null,null,null,null,null,null,null,null,null,null,null,"MODELO 130"]
["Consulte los detalles de la licencia en: http://www.gnu.org/licenses/fdl.txt",null,null,null,null,null,null,null,null,null,null,null,null,null,null,"MODELO 303"]
[null,null,null,null,null,null,null,null,null,null,null,null,null,null,null,"MODELO 390"]
[null,null,null,null,null,null,null,null,null,null,null,null,null,null,null,"MODELO 347"]
["Agradecimientos:",null,null,null,null,null,null,null,null,null,null,null,null,null,null,"GESTIÓN TRIBUTARIA PARA PEQUEÑOS EMPRESARIOS"]
["A todos los que han aportado ideas y correcciones con las que se ha ido mejorando esta plantilla.",null,null,null,null,null,null,null,null,null,null,null,null,null,null,"Libro Registro de Ventas e Ingresos"]
["Especialmente agradecer a Jose Manuel Sánchez Puchades de Sánchez Castelló,S.L. (Valencia: asesoría fiscal, laboral y contable)",null,null,null,null,null,null,null,null,null,null,null,null,null,null,"Libro Registro de Compras y Gastos"]
["que aportó varias ideas fundamentales para la utilidad actual de la plantilla.",null,null,null,null,null,null,null,null,null,null,null,null,null,null,"IVA"]
[null,null,null,null,null,null,null,null,null,null,null,null,null,null,null,"IRPF"]
[]
["últimas actualizaciones:"]
["    * 26/01/2015 corregido error según comenta JuanL Rodríguez el 26 de Enero de 2015 (referido al diseño de registro para la impresión del Modelo 130). Gracias por su aportación."]
["    * 15/02/2015 Aportación de Marc Morales en comentario de febrero de 2015: corregida fórmula en la hoja cálculos, en la celda D5 y en las inferiores, para establecer un límite de 2000 euros en los gastos de difícil justificación: =SI((B5-C5)>=0;C5+MIN(REDONDEAR(0,05*(B5-C5);2);2000);C5)  Corregido también en la hoja 'IRPF ANUAL' la celda D43: establecido el mismo límite de 2000 euros."]
["    * 17/02/2015 Aportaciones de Jose Mª el 30/01/2015 y Marc Morales el 6/02/15: se corrige el tipo predeterminado de retención de IRPF en ingresos: cambiado del 21 al 19."]
{"$rows_left_out":35}