{"text_format":"1","workbook":"xlsx","n_sheets":12,"sheets":["DATOS FISCALES","INGRESOS","GASTOS","303","IRPF ANUAL","CALCULOS","CLIENTES","PROVEEDORES","Bienes de inversión","FACTURA","FACTURA R.EQ","Acerca de"],"not_rendered":{"charts":0,"images":0,"macros":1,"external_links":0,"defined_names":14,"comments":11,"pivot_tables":0},"unopened":[],"bounds":{"document_bytes":16777216,"sheet_cells":100000,"rows_first":2000,"rows_last":500,"rows_between":2000,"halvings":0,"cell_chars":16384,"cell_head_chars":4096},"cells_cut":0,"cells_raw":0,"read":"whole","date_system":"1900"}

{"sheet":"DATOS FISCALES","index":0,"n_rows":271,"n_cols":9,"rows_kept":271,"cut":false,"hidden":false,"merged":[]}
[]
[null,"NIF","34999999W","Para calcular la casilla 13 del Modelo 130"]
[null,"Nombre o Razón Social",null,"(es decir, la deducción del artículo 10.3 c) del Reglamento del IRPF)"]
[null,"Nombre","NOMBRE","Se calcula según los rendimientos netos del ejercicio anterior"]
[null,"Primer Apellido","APELLIDOA","Este importe lo obtenemos:"]
[null,"Segundo Apellido","APELLIDOB"," - De la casilla 03 del Modelo 130 del último trimestre del año anterior"]
{"$rows_left_out":266}
{"sheet":"INGRESOS","index":1,"n_rows":102,"n_cols":25,"rows_kept":102,"cut":false,"hidden":false,"merged":[]}
["FECHA\nREGISTRO","FECHA\nFACTURA","Nº FACTURA","NIF","APELLIDOS Y NOMBRE O RAZÓN SOCIAL","BASE IMPONIBLE","%\nIVA","%\nREC.EQ.","CUOTA\nIVA","CUOTA\nREC. EQ.","CUOTA RETENC\nIRPF","TOTAL FACTURA","INTRACOMUNITARIO","RECTIFICATIVAS","R.E. CRITERIO CAJA","FECHA COBRO","CRITERIO CAJA BASE","%\nIVA","CRITERIO CAJA CUOTA","MEDIO DE COBRO",null,"Trimestre","Trimestre Rég. Criterio Caja","Nº de Declarado Modelo 347","Trimestre Modelo 347"]
[null,{"$f":"IF(A2<>\"\",A2,\"\")","v":""},null,{"$f":"IF(E2<>\"\",VLOOKUP(E2,CLIENTES!A$2:B$200,2,FALSE),\"\")","v":""},null,null,21,null,{"$f":"ROUND((F2*(G2/100)),2)","v":0},{"$f":"ROUND((F2*(H2/100)),2)","v":0},null,{"$f":"+F2+I2+J2-K2","v":0},null,null,null,null,null,null,{"$f":"ROUND((Q2*(R2/100)),2)","v":0},null,null,{"$f":"IF(A2>0,ROUNDUP(MONTH(A2)/3,0),0)","v":0},{"$f":"IF(P2>0,ROUNDUP(MONTH(P2)/3,0),0)","v":0},{"$f":"IF(AND(D2<>\"\",ISBLANK(M2),SUMIF($D$2:$D$101,D2,$F$2:$F$101)+SUMIF($D$2:$D$101,D2,$I$2:$I$101)+SUMIF($D$2:$D$101,D2,$J$2:$J$101)>3005.06),IF(COUNTIF($D$2:D2,D2)>1,VLOOKUP(D2,D$2:X2,21,FALSE),MAX($X$1:X1)+1),0)","v":0},{"$f":"IF(X2>0,ROUNDUP(MONTH(B2)/3,0),0)","v":0}]
[null,"",null,{"$f":"IF(E3<>\"\",VLOOKUP(E3,CLIENTES!A$2:B$200,2,FALSE),\"\")","v":""},null,null,21,null,0,{"$f":"ROUND((F3*(H3/100)),2)","v":0},null,{"$f":"+F3+I3+J3-K3","v":0},null,null,null,null,null,null,{"$f":"ROUND((Q3*(R3/100)),2)","v":0},null,null,{"$f":"IF(A3>0,ROUNDUP(MONTH(A3)/3,0),0)","v":0},{"$f":"IF(P3>0,ROUNDUP(MONTH(P3)/3,0),0)","v":0},{"$f":"IF(AND(D3<>\"\",ISBLANK(M3),SUMIF($D$2:$D$101,D3,$F$2:$F$101)+SUMIF($D$2:$D$101,D3,$I$2:$I$101)+SUMIF($D$2:$D$101,D3,$J$2:$J$101)>3005.06),IF(COUNTIF($D$2:D3,D3)>1,VLOOKUP(D3,D$2:X3,21,FALSE),MAX($X$1:X2)+1),0)","v":0},{"$f":"IF(X3>0,ROUNDUP(MONTH(B3)/3,0),0)","v":0}]
[null,"",null,{"$f":"IF(E4<>\"\",VLOOKUP(E4,CLIENTES!A$2:B$200,2,FALSE),\"\")","v":""},null,null,21,null,0,0,null,0,null,null,null,null,null,null,0,null,null,0,0,{"$f":"IF(AND(D4<>\"\",ISBLANK(M4),SUMIF($D$2:$D$101,D4,$F$2:$F$101)+SUMIF($D$2:$D$101,D4,$I$2:$I$101)+SUMIF($D$2:$D$101,D4,$J$2:$J$101)>3005.06),IF(COUNTIF($D$2:D4,D4)>1,VLOOKUP(D4,D$2:X4,21,FALSE),MAX($X$1:X3)+1),0)","v":0},0]
[null,"",null,{"$f":"IF(E5<>\"\",VLOOKUP(E5,CLIENTES!A$2:B$200,2,FALSE),\"\")","v":""},null,null,21,null,0,0,null,0,null,null,null,null,null,null,0,null,null,0,0,{"$f":"IF(AND(D5<>\"\",ISBLANK(M5),SUMIF($D$2:$D$101,D5,$F$2:$F$101)+SUMIF($D$2:$D$101,D5,$I$2:$I$101)+SUMIF($D$2:$D$101,D5,$J$2:$J$101)>3005.06),IF(COUNTIF($D$2:D5,D5)>1,VLOOKUP(D5,D$2:X5,21,FALSE),MAX($X$1:X4)+1),0)","v":0},0]
[null,"",null,{"$f":"IF(E6<>\"\",VLOOKUP(E6,CLIENTES!A$2:B$200,2,FALSE),\"\")","v":""},null,null,21,null,0,0,null,0,null,null,null,null,null,null,0,null,null,0,0,{"$f":"IF(AND(D6<>\"\",ISBLANK(M6),SUMIF($D$2:$D$101,D6,$F$2:$F$101)+SUMIF($D$2:$D$101,D6,$I$2:$I$101)+SUMIF($D$2:$D$101,D6,$J$2:$J$101)>3005.06),IF(COUNTIF($D$2:D6,D6)>1,VLOOKUP(D6,D$2:X6,21,FALSE),MAX($X$1:X5)+1),0)","v":0},0]
{"$rows_left_out":97}
{"sheet":"GASTOS","index":2,"n_rows":102,"n_cols":40,"rows_kept":102,"cut":false,"hidden":false,"merged":[]}
["FECHA\nREGISTRO","FECHA\nFACTURA","Nº FACTURA","NIF","APELLIDOS Y NOMBRE O RAZÓN SOCIAL","DESCRIPCIÓN","CONSUMOS\nEXPLOTACIÓN","SUELDOS\nSALARIOS","OTROS GASTOS\nPERSONAL","SEGURIDAD\nSOCIAL","ARRENDAM. CÁNONES","REPARACIONES\nCONSERVACIÓN","SERVICIOS\nPROFESIONALES\nINDEPENDIENTES","OTROS SERV.\nEXTERIORES (INCLUID. SUMINISTROS)","TRIBUTOS DEDUCIBLES","GASTOS FINANCIEROS","AMORTIZACIONES DOTACIONES DEDUCIBLES","PÉRDIDAS DETERIORO VALOR ELEMENTOS PATRIMONIALES","OTROS\nGASTOS","BASE IMPONIBLE IRPF","BASE IMPONIBLE IVA","%\nIVA","CUOTA\nIVA\nSOPORT","RETENCIÓN\nIRPF","TOTAL FACTURA","INTRACOMUNITARIO","BIENES DE INVERSIÓN (op.interior.)","RECTIFICATIVAS","CRITERIO CAJA","FECHA PAGO","CRITERIO CAJA BASE","%\nIVA","CRITERIO CAJA CUOTA","MEDIO DE PAGO","COMPENSACIONES REG. AGP GAN Y P.",null,"Trimestre","Trimestre Rég. Criterio Caja","Nº de Declarado Modelo 347","Trimestre Modelo 347"]
[null,{"$f":"IF(A2<>\"\",A2,\"\")","v":""},null,{"$f":"IF(E2<>\"\",VLOOKUP(E2,PROVEEDORES!A$2:B$200,2,FALSE),\"\")","v":""},null,null,null,null,null,null,null,null,null,null,null,null,null,null,null,{"$f":"SUM(G2:S2)","v":0},{"$f":"SUM(G2,K2:N2,S2)","v":0},21,{"$f":"ROUND((U2*(V2/100)),2)","v":0},null,{"$f":"SUM(U2)+W2-X2","v":0},null,null,null,null,null,null,null,{"$f":"ROUND((AE2*(AF2/100)),2)","v":0},null,null,null,{"$f":"IF(A2>0,ROUNDUP(MONTH(A2)/3,0),0)","v":0},{"$f":"IF(AND(AC2>0,AD2>0),ROUNDUP(MONTH(AD2)/3,0),0)","v":0},{"$f":"IF(AND(D2<>\"\",ISBLANK(Z2),SUMIF($D$2:$D$101,D2,$U$2:$U$101)+SUMIF($D$2:$D$101,D2,$W$2:$W$101)>3005.06),IF(COUNTIF($D$2:D2,D2)>1,VLOOKUP(D2,D$2:AM2,36,FALSE),IF(MAX($AM$1:AM1)>MAX(INGRESOS!$X$1:$X$101),MAX($AM$1:AM1)+1,MAX(INGRESOS!$X$1:$X$101)+1)),0)","v":0},{"$f":"IF(AM2>0,ROUNDUP(MONTH(B2)/3,0),0)","v":0}]
[null,{"$f":"IF(A3<>\"\",A3,\"\")","v":""},null,{"$f":"IF(E3<>\"\",VLOOKUP(E3,PROVEEDORES!A$2:B$200,2,FALSE),\"\")","v":""},null,null,null,null,null,null,null,null,null,null,null,null,null,null,null,0,{"$f":"SUM(G3,K3:N3,S3)","v":0},21,{"$f":"ROUND((U3*(V3/100)),2)","v":0},null,{"$f":"SUM(U3)+W3-X3","v":0},null,null,null,null,null,null,null,{"$f":"ROUND((AE3*(AF3/100)),2)","v":0},null,null,null,{"$f":"IF(A3>0,ROUNDUP(MONTH(A3)/3,0),0)","v":0},{"$f":"IF(AND(AC3>0,AD3>0),ROUNDUP(MONTH(AD3)/3,0),0)","v":0},{"$f":"IF(AND(D3<>\"\",ISBLANK(Z3),SUMIF($D$2:$D$101,D3,$U$2:$U$101)+SUMIF($D$2:$D$101,D3,$W$2:$W$101)>3005.06),IF(COUNTIF($D$2:D3,D3)>1,VLOOKUP(D3,D$2:AM3,36,FALSE),IF(MAX($AM$1:AM2)>MAX(INGRESOS!$X$1:$X$101),MAX($AM$1:AM2)+1,MAX(INGRESOS!$X$1:$X$101)+1)),0)","v":0},0]
[null,"",null,{"$f":"IF(E4<>\"\",VLOOKUP(E4,PROVEEDORES!A$2:B$200,2,FALSE),\"\")","v":""},null,null,null,null,null,null,null,null,null,null,null,null,null,null,null,0,0,21,0,null,0,null,null,null,null,null,null,null,0,null,null,null,0,0,{"$f":"IF(AND(D4<>\"\",ISBLANK(Z4),SUMIF($D$2:$D$101,D4,$U$2:$U$101)+SUMIF($D$2:$D$101,D4,$W$2:$W$101)>3005.06),IF(COUNTIF($D$2:D4,D4)>1,VLOOKUP(D4,D$2:AM4,36,FALSE),IF(MAX($AM$1:AM3)>MAX(INGRESOS!$X$1:$X$101),MAX($AM$1:AM3)+1,MAX(INGRESOS!$X$1:$X$101)+1)),0)","v":0},0]
[null,"",null,{"$f":"IF(E5<>\"\",VLOOKUP(E5,PROVEEDORES!A$2:B$200,2,FALSE),\"\")","v":""},null,null,null,null,null,null,null,null,null,null,null,null,null,null,null,0,0,21,0,null,0,null,null,null,null,null,null,null,0,null,null,null,0,0,{"$f":"IF(AND(D5<>\"\",ISBLANK(Z5),SUMIF($D$2:$D$101,D5,$U$2:$U$101)+SUMIF($D$2:$D$101,D5,$W$2:$W$101)>3005.06),IF(COUNTIF($D$2:D5,D5)>1,VLOOKUP(D5,D$2:AM5,36,FALSE),IF(MAX($AM$1:AM4)>MAX(INGRESOS!$X$1:$X$101),MAX($AM$1:AM4)+1,MAX(INGRESOS!$X$1:$X$101)+1)),0)","v":0},0]
[null,"",null,{"$f":"IF(E6<>\"\",VLOOKUP(E6,PROVEEDORES!A$2:B$200,2,FALSE),\"\")","v":""},null,null,null,null,null,null,null,null,null,null,null,null,null,null,null,0,0,21,0,null,0,null,null,null,null,null,null,null,0,null,null,null,0,0,{"$f":"IF(AND(D6<>\"\",ISBLANK(Z6),SUMIF($D$2:$D$101,D6,$U$2:$U$101)+SUMIF($D$2:$D$101,D6,$W$2:$W$101)>3005.06),IF(COUNTIF($D$2:D6,D6)>1,VLOOKUP(D6,D$2:AM6,36,FALSE),IF(MAX($AM$1:AM5)>MAX(INGRESOS!$X$1:$X$101),MAX($AM$1:AM5)+1,MAX(INGRESOS!$X$1:$X$101)+1)),0)","v":0},0]
{"$rows_left_out":97}
{"sheet":"303","index":3,"n_rows":133,"n_cols":43,"rows_kept":133,"cut":false,"hidden":false,"merged":[[4,1,4,7],[20,14,20,24],[30,27,30,31],[1,38,2,40],[11,27,11,31],[11,33,11,40],[1,30,2,32],[10,27,10,31],[10,33,10,40],[10,14,10,24],[17,27,17,31],[17,14,17,24],[11,14,11,24],[12,14,12,24],[12,27,12,31],[13,27,13,31],[13,14,13,24],[14,14,14,24],[15,14,15,24],[16,14,16,24],[28,33,28,40],[29,33,29,40],[66,14,66,15],[48,33,48,40],[29,27,29,31],[54,33,54,40],[63,7,63,15],[63,30,63,37],[18,14,18,24],[25,33,25,40],[19,14,19,24],[20,33,20,40],[19,33,19,40],[22,33,22,40],[18,27,18,31],[19,27,19,31],[24,33,24,40],[24,27,24,31],[17,33,17,40],[18,33,18,40],[12,33,12,40],[13,33,13,40],[14,33,14,40],[15,33,15,40],[16,33,16,40],[4,9,4,35],[31,27,31,31],[49,14,49,16],[56,33,56,40],[52,33,52,40],[50,33,50,40],[30,33,30,40],[43,27,43,31],[43,33,43,40],[45,27,45,31],[49,33,49,40],[27,33,27,40],[26,33,26,40],[38,33,38,40],[32,33,32,40],[33,33,33,40],[42,1,42,26],[75,1,75,20],[66,24,66,40],[25,27,25,31],[26,27,26,31],[27,27,27,31],[28,27,28,31],[34,33,34,40],[36,33,36,40],[42,27,42,31],[42,33,42,40],[31,33,31,40],[41,33,41,40],[45,33,45,40],[72,8,72,16],[56,3,56,8]]}
[]
[null,"IVA Modelo 303 (borrador)",null,null,null,null,null,null,null,null,null,null,null,null,null,null,null,null,null,null,null,null,null,null,null,null,"Ejercicio",null,null,null,{"$f":"IF(NOT(ISBLANK(INGRESOS!A2)),YEAR(INGRESOS!A2),IF(NOT(ISBLANK(GASTOS!A2)),YEAR(GASTOS!A2),YEAR(TODAY())))","v":2022},null,null,"    Período",null,null,null,null,"1T"]
[]
[null,"NIF",null,null,null,null,null,null,null,"Apellidos y Nombre o Razón social",null,null,null,null,null,null,null,null,null,null,null,null,null,null,null,null,null,null,null,null,null,null,null,null,null,null,null,null,null,null,{"$f":"VALUE(LEFT(AM2,1))","v":1}]
[null,{"$f":"'DATOS FISCALES'!C2","v":"34999999W"},null,null,null,null,null,null,null,{"$f":"'DATOS FISCALES'!C5&\" \"&'DATOS FISCALES'!C6&\" \"&'DATOS FISCALES'!C4","v":"APELLIDOA APELLIDOB NOMBRE"}]
[null,null,null,null,null,null,null,null,null,null,null,null,null,null,"SI",null,"NO",null,null,null,null,null,null,null,null,null,null,null,null,null,null,null,null,null,null,null,null,null,"SI",null,"NO"]
{"$rows_left_out":128}
{"sheet":"IRPF ANUAL","index":4,"n_rows":77,"n_cols":4,"rows_kept":77,"cut":false,"hidden":false,"merged":[]}
[null,"RENDIMIENTOS DE ACTIVIDADES ECONÓMICAS EN ESTIMACIÓN DIRECTA"]
[]
[null,"Actividades realizadas"]
[]
[null,"Contribuyente que realiza la/s actividad/es","086","DECLARANTE"]
[null,"Tipo de actividad/es realizada/s: clave indicativa","087",{"$f":"'DATOS FISCALES'!C9","v":5}]
{"$rows_left_out":72}
{"sheet":"CALCULOS","index":5,"n_rows":69,"n_cols":71,"rows_kept":69,"cut":false,"hidden":false,"merged":[[20,69,20,70],[20,13,20,18],[20,47,20,52],[20,53,20,58],[20,59,20,64],[20,65,20,66],[20,67,20,68],[20,27,20,32],[35,11,36,11],[20,25,20,26],[35,23,36,23],[35,24,36,24],[35,16,36,16],[20,7,20,12],[35,22,36,22],[35,21,36,21],[35,25,36,25],[20,19,20,24],[20,0,22,0],[35,5,36,5],[35,8,36,8],[35,9,36,9],[35,17,35,20],[20,1,20,6],[11,0,12,0],[35,0,36,0],[35,1,36,1],[35,12,35,15],[35,6,36,6],[35,2,36,2],[35,3,36,3],[35,4,36,4],[35,7,36,7],[11,1,11,2],[35,10,36,10],[13,1,16,1],[11,34,12,34],[11,27,11,30],[11,31,11,32],[11,33,12,33],[11,23,11,24],[11,25,11,26],[11,3,11,14],[11,15,11,16],[11,17,11,18],[11,19,11,20],[11,21,11,22],[11,35,11,39],[11,40,12,40],[11,41,12,41],[20,33,20,34],[20,35,20,40],[20,41,20,46]]}
[]
["CÁLCULOS TRIMESTRALES PARA EL MODELO 130: IRPF"]
[]
["TRIMESTRE","Ingresos Casilla [01]","Gastos Brutos","Casilla [02] Gastos con deducción","Casilla [05]","Casilla [06] Retenc.\nsoportad","Casilla [07] Pago fraccionado",null,null,"Casilla [11]","Casilla [12]","Casilla [13] Deducción del art. 110.3 c) Regl. IRPF","Casilla [15]\nCompensar negativas anteriores","Casilla [17]","Casilla [18]","Casilla [19]"]
["1T",{"$f":"SUMIF(INGRESOS!$V$2:$V$101,1,INGRESOS!$F$2:$F$101)","v":0},{"$f":"SUMIF(GASTOS!$AK$2:$AK$101,1,GASTOS!$T$2:$T$101)","v":0},{"$f":"IF((B5-C5)>=0,C5+MIN(ROUND(0.05*(B5-C5),2),2000),C5)","v":0},0,{"$f":"ROUND(SUMIF(INGRESOS!$V$2:$V$101,1,INGRESOS!$K$2:$K$101),2)","v":0},{"$f":"ROUND(IF((B5-D5)>=0,0.2*(B5-D5),0)-(E5+F5),2)","v":0},null,null,null,{"$f":"IF(G5+J5>0,G5+J5,0)","v":0},{"$f":"IF('DATOS FISCALES'!C$8>12000,0,IF('DATOS FISCALES'!C$8>=11000.01,25,IF('DATOS FISCALES'!C$8>=10000.01,50,IF('DATOS FISCALES'!C$8>=9000.01,75,100))))","v":100},0,{"$f":"K5-L5-M5","v":-100},null,{"$f":"N5-O5","v":-100}]
["2T",{"$f":"SUMIF(INGRESOS!$V$2:$V$101,\"<=2\",INGRESOS!$F$2:$F$101)","v":0},{"$f":"SUMIF(GASTOS!$AK$2:$AK$101,\"<=2\",GASTOS!$T$2:$T$101)","v":0},{"$f":"IF((B6-C6)>=0,C6+MIN(ROUND(0.05*(B6-C6),2),2000),C6)","v":0},{"$f":"IF(G5>0,G5,0)","v":0},{"$f":"ROUND(SUMIF(INGRESOS!$V$2:$V$101,\"<=2\",INGRESOS!$K$2:$K$101),2)","v":0},{"$f":"ROUND(IF((B6-D6)>=0,0.2*(B6-D6),0)-(E6+F6),2)","v":0},null,null,null,{"$f":"IF(G6+J6>0,G6+J6,0)","v":0},{"$f":"IF('DATOS FISCALES'!C$8>12000,0,IF('DATOS FISCALES'!C$8>=11000.01,25,IF('DATOS FISCALES'!C$8>=10000.01,50,IF('DATOS FISCALES'!C$8>=9000.01,75,100))))","v":100},{"$f":"IF(AND(K6-L6>0,P5<0),IF(ABS(P5)<K6-L6,ABS(P5),K6-L6),0)","v":0},{"$f":"K6-L6-M6","v":-100},null,{"$f":"N6-O6","v":-100}]
{"$rows_left_out":64}
{"sheet":"CLIENTES","index":6,"n_rows":4,"n_cols":5,"rows_kept":4,"cut":false,"hidden":false,"merged":[]}
["APELLIDOS Y NOMBRE O RAZÓN SOCIAL","NIF / CIF","Para Modelo 347:\nPROVINCIA","Para Modelo 347: Arrendamiento local negocio: \"X\"","Para M-347: Importe  percibido  en  metálico"]
["CLIENTE A","A12896448","MADRID"]
["CLIENTE B","A1111111","BARCELONA"]
["CLIENTE C","B12345678","ALBACETE"]

{"sheet":"PROVEEDORES","index":7,"n_rows":4,"n_cols":5,"rows_kept":4,"cut":false,"hidden":false,"merged":[]}
["APELLIDOS Y NOMBRE O RAZÓN SOCIAL","NIF / CIF","Para Modelo 347:\nPROVINCIA","Para Modelo 347: Arrendamiento local negocio: \"X\"","Para M-347: Importe  percibido  en  metálico"]
["PROVEEDOR A","A12896448","MADRID"]
["PROVEEDOR B","A1111111","BARCELONA"]
["PROVEEDOR C","B12345678","ALBACETE"]

{"sheet":"Bienes de inversión","index":8,"n_rows":43,"n_cols":13,"rows_kept":43,"cut":false,"hidden":false,"merged":[[4,8,4,9],[4,10,4,11],[5,8,5,9],[8,1,8,2],[8,3,8,4],[8,5,8,6],[4,1,7,1],[4,2,7,7],[1,1,2,1],[1,11,2,11],[1,2,1,4],[1,5,1,7],[1,8,1,9],[1,10,2,10],[5,10,5,11],[6,8,6,9],[6,10,6,11],[7,8,7,9],[7,10,7,11],[17,8,17,9],[17,10,17,11],[11,1,12,1],[11,2,11,4],[11,5,11,7],[11,8,11,9],[14,1,17,1],[14,2,17,7],[14,8,14,9],[11,10,12,10],[11,11,12,11],[14,10,14,11],[15,8,15,9],[15,10,15,11],[16,8,16,9],[16,10,16,11],[25,10,25,11],[26,8,26,9],[18,1,18,2],[18,3,18,4],[18,5,18,6],[21,1,22,1],[21,2,21,4],[21,5,21,7],[28,1,28,2],[28,3,28,4],[28,5,28,6],[21,8,21,9],[31,10,32,10],[26,10,26,11],[27,8,27,9],[27,10,27,11],[31,1,32,1],[21,10,22,10],[21,11,22,11],[24,1,27,1],[24,2,27,7],[24,8,24,9],[24,10,24,11],[25,8,25,9],[31,2,31,4],[31,5,31,7],[31,8,31,9],[36,8,36,9],[36,10,36,11],[34,8,34,9],[34,10,34,11],[35,8,35,9],[31,11,32,11],[35,10,35,11],[38,1,38,2],[38,3,38,4],[38,5,38,6],[34,1,37,1],[34,2,37,7],[37,8,37,9],[37,10,37,11]]}
[null,"MANGLOSER ES EL AUTOR DE ESTA HOJA Y SUS MACROS, NUESTRO MÁS SINCERO AGRADECIMIENTO."]
[null,"Nº Anotación","Fecha ",null,null,"inmovilizado, material e inmaterial",null,null,"Valor de adquisición",null,"% amortización","Nº Trimestres"]
[null,null,"Factura","inicio Amort.","Fin Amort.","Nº Factura","CIF","PROVEEDOR","Base imponible","IVA"]
[null,1,"2012-05-17",{"$f":"IF(C4<>\"\",IF(MONTH(C4)<=3,DATE(YEAR(C4),3,31),IF(AND(MONTH(C4)>3,MONTH(C4)<=6),DATE(YEAR(C4),6,30),IF(AND(MONTH(C4)>6,MONTH(C4)<=9),DATE(YEAR(C4),9,30),(DATE(YEAR(C4),12,31))))),\"\")","v":"2012-06-30"},{"$f":"IF(C4<>\"\",EDATE(D4,(L4*3-3)),\"\")","v":"2018-06-30"},13485,"B-------","Proveedor A, S.L.",14775.42,2659.58,0.16,{"$f":"ROUNDUP((4)/(K4),0)","v":25}]
["  ,,,,,,,,,,,,,,,,,,,,,,,,,,,,,,,,,,,,,,,,,,,,,,,,,,,,,,,,,,,,,ol.               ","Descripción","furgoneta marca A matrícula _____",null,null,null,null,null,"Cuota amort. Trimestre",null,{"$f":"IF(I4<>\"\",SLN(I4,0,L4),\"\")","v":591.01679999999999},null,{"$f":"IF(I4<>\"\",IF(AND(MONTH(C4)<=3,YEAR(C4)=2012),I4/L4,\"\"))","v":""}]
[null,null,null,null,null,null,null,null,"Total amort. 1er año",null,{"$f":"IF(D4<>\"\",IF(MONTH(D4)<=3,(K5*4),IF(AND(MONTH(D4)>3,MONTH(D4)<=6),(K5*3),IF(AND(MONTH(D4)>6,MONTH(D4)<=9),(K5*2),K5))),\"\")","v":1773.0504000000001}]
{"$rows_left_out":38}
{"sheet":"FACTURA","index":9,"n_rows":45,"n_cols":9,"rows_kept":45,"cut":false,"hidden":false,"merged":[[14,2,14,4],[9,1,9,4],[10,1,10,4],[11,1,11,4]]}
["FACTURA",null,null,null,null,null,null,null,"Mostrar Calculadora de Windows (Ctl+w)"]
[]
[]
[{"$f":"'DATOS FISCALES'!C4 & \" \" & 'DATOS FISCALES'!C5 & \" \" & 'DATOS FISCALES'!C6","v":"NOMBRE APELLIDOA APELLIDOB"},null,null,null,null,"Factura nº:"]
["ESCRIBIR DIRECCIÓN"]
[{"$f":"\"NIF: \" & 'DATOS FISCALES'!C2","v":"NIF: 34999999W"},null,null,null,null,"Fecha:",{"$f":"TODAY()","v":"2022-04-26"}]
{"$rows_left_out":40}
{"sheet":"FACTURA R.EQ","index":10,"n_rows":53,"n_cols":19,"rows_kept":53,"cut":false,"hidden":false,"merged":[[13,16,14,16],[15,14,15,15],[13,8,14,8],[13,9,14,9],[13,10,14,11],[13,12,14,13],[15,10,15,11],[15,12,15,13],[13,14,14,15],[16,14,16,15],[17,0,17,1],[17,2,17,7],[17,10,17,11],[17,12,17,13],[17,14,17,15],[16,0,16,1],[16,2,16,7],[16,10,16,11],[16,12,16,13],[18,14,18,15],[19,0,19,1],[19,2,19,7],[19,10,19,11],[19,12,19,13],[19,14,19,15],[18,0,18,1],[18,2,18,7],[18,10,18,11],[18,12,18,13],[20,14,20,15],[21,0,21,1],[21,2,21,7],[21,10,21,11],[21,12,21,13],[21,14,21,15],[20,0,20,1],[20,2,20,7],[20,10,20,11],[20,12,20,13],[22,14,22,15],[23,0,23,1],[23,2,23,7],[23,10,23,11],[23,12,23,13],[23,14,23,15],[22,0,22,1],[22,2,22,7],[22,10,22,11],[22,12,22,13],[24,14,24,15],[25,0,25,1],[25,2,25,7],[25,10,25,11],[25,12,25,13],[25,14,25,15],[24,0,24,1],[24,2,24,7],[24,10,24,11],[24,12,24,13],[26,14,26,15],[27,0,27,1],[27,2,27,7],[27,10,27,11],[27,12,27,13],[27,14,27,15],[26,0,26,1],[26,2,26,7],[26,10,26,11],[26,12,26,13],[28,14,28,15],[29,0,29,1],[29,2,29,7],[29,10,29,11],[29,12,29,13],[29,14,29,15],[28,0,28,1],[28,2,28,7],[28,10,28,11],[28,12,28,13],[30,14,30,15],[31,0,31,1],[31,2,31,7],[31,10,31,11],[31,12,31,13],[31,14,31,15],[30,0,30,1],[30,2,30,7],[30,10,30,11],[30,12,30,13],[32,14,32,15],[33,0,33,1],[33,2,33,7],[33,10,33,11],[33,12,33,13],[33,14,33,15],[32,0,32,1],[32,2,32,7],[32,10,32,11],[32,12,32,13],[35,0,35,1],[35,2,35,7],[35,10,35,11],[35,12,35,13],[35,14,35,15],[34,0,34,1],[34,2,34,7],[34,10,34,11],[34,12,34,13],[37,0,37,1],[37,2,37,7],[37,10,37,11],[37,12,37,13],[37,14,37,15],[36,0,36,1],[36,2,36,7],[36,10,36,11],[36,12,36,13],[39,0,39,1],[39,2,39,7],[39,10,39,11],[39,12,39,13],[39,14,39,15],[38,0,38,1],[38,2,38,7],[38,10,38,11],[38,12,38,13],[3,6,3,7],[5,6,5,7],[0,6,0,17],[1,6,1,17],[2,6,2,17],[50,0,50,1],[50,3,50,4],[50,6,50,7],[49,0,49,1],[49,3,49,4],[46,14,46,15],[44,14,44,15],[45,0,45,1],[45,2,45,7],[45,10,45,11],[45,12,45,13],[45,14,45,15],[46,0,46,1],[46,2,46,7],[46,10,46,11],[46,12,46,13],[47,0,48,1],[47,2,47,4],[47,5,47,7],[51,0,51,1],[51,3,51,4],[51,6,51,7],[52,0,52,1],[52,3,52,4],[52,6,52,7],[8,1,8,5],[10,1,10,5],[11,1,11,5],[43,0,43,1],[43,2,43,7],[9,1,9,5],[13,0,14,1],[15,0,15,1],[15,2,15,7],[13,2,14,7],[48,3,48,4],[44,0,44,1],[44,2,44,7],[42,0,42,1],[42,2,42,7],[41,0,41,1],[41,2,41,7],[40,0,40,1],[49,16,49,17],[8,6,8,16],[13,17,14,17],[47,16,47,17],[48,6,48,7],[49,6,49,7],[42,14,42,15],[43,14,43,15],[40,14,40,15],[41,14,41,15],[44,10,44,11],[44,12,44,13],[43,10,43,11],[43,12,43,13],[42,10,42,11],[42,12,42,13],[41,10,41,11],[41,12,41,13],[40,2,40,7],[40,10,40,11],[40,12,40,13],[38,14,38,15],[36,14,36,15],[34,14,34,15]]}
["FACTURA",null,null,null,null,null,{"$f":"'DATOS FISCALES'!C4 & \" \" & 'DATOS FISCALES'!C5 & \" \" & 'DATOS FISCALES'!C6","v":"NOMBRE APELLIDOA APELLIDOB"},null,null,null,null,null,null,null,null,null,null,null,"Mostrar Calculadora de Windows (Ctl+w)"]
[null,null,null,null,null,null,{"$f":"\"NIF: \" & 'DATOS FISCALES'!C2","v":"NIF: 34999999W"}]
[null,null,null,null,null,null,"Escribir dirección ...."]
[null,null,null,null,null,"Factura nº:"]
[]
[null,null,null,null,null,"Fecha:",{"$f":"TODAY()","v":"2022-04-26"}]
{"$rows_left_out":48}
{"sheet":"Acerca de","index":11,"n_rows":55,"n_cols":16,"rows_kept":55,"cut":false,"hidden":false,"merged":[[6,0,6,14]]}
["Plantilla de Excel para gestión de impuestos"]
["Programa de Excel para gestión de impuestos de empresarios individuales y profesionales autónomos"]
[null,null,null,null,null,null,null,null,null,null,null,null,null,null,null,"Keywords"]
["Este archivo de Excel (\"plantilla\") se ofrece gratuitamente con la esperanza de que sea útil, pero SIN GARANTÍA ALGUNA;",null,null,null,null,null,null,null,null,null,null,null,null,null,null,"APLICACIÓN EXCEL"]
["ni siquiera la garantía implícita MERCANTIL o de APTITUD PARA UN PROPÓSITO DETERMINADO.",null,null,null,null,null,null,null,null,null,null,null,null,null,null,"GESTIÓN DE IMPUESTOS AUTÓNOMOS"]
[null,null,null,null,null,null,null,null,null,null,null,null,null,null,null,"CÁLCULO DE DECLARACIONES TRIMESTRALES EN EXCEL"]
{"$rows_left_out":49}